Reaction Details
TargetLysophosphatidic acid receptor 2
LigandBDBM50195700
Substrate/Competitorn/a
Meas. Tech.ChEMBL_1617902 (CHEMBL3859971)
IC50 790±n/a nM
Citation Terakado, MSuzuki, HHashimura, KTanaka, MUeda, HKohno, HFujimoto, TSaga, HNakade, SHabashita, HTakaoka, YSeko, T Discovery of ONO-7300243 from a Novel Class of Lysophosphatidic Acid Receptor 1 Antagonists: From Hit to Lead. ACS Med Chem Lett7:913-918 (2016) 
 
Lysophosphatidic acid receptor 2
Name:Lysophosphatidic acid receptor 2
Type:PROTEIN
Mol. Mass.:39103.44
Organism:Homo sapiens (Human)
Description:ChEMBL_1451385
Residue:351
BDBM50195700
NameBDBM50195700
Synonyms:CHEMBL3975893
TypeSmall organic molecule
Emp. Form.C33H32ClNO6
Mol. Mass.574.063
SMILESCOc1cc(cc(OC)c1C)C(=O)N(CCCc1ccccc1)Cc1ccc(Oc2ccc(Cl)cc2C(O)=O)cc1