Reaction Details
TargetProteasome subunit beta type-2
LigandBDBM50069985
Substrate/Competitorn/a
Meas. Tech.ChEMBL_1618121 (CHEMBL3860290)
Ki 22100±n/a nM
Citation Di Giovanni, CEttari, RSarno, SRotondo, ABitto, ASquadrito, FAltavilla, DSchirmeister, TNovellino, EGrasso, SZappalą, MLavecchia, A Identification of noncovalent proteasome inhibitors with high selectivity for chymotrypsin-like activity by a multistep structure-based virtual screening. Eur J Med Chem121:578-591 (2016) 
 
Proteasome subunit beta type-2
Name:Proteasome subunit beta type-2
Type:PROTEIN
Mol. Mass.:22837.53
Organism:Homo sapiens (Human)
Description:ChEMBL_1294233
Residue:201
BDBM50069985
NameBDBM50069985
Synonyms:(S)-4-methyl-2-(3-phenyl-propionylamino)-pentanoic acid [(S)-1-((S)-1-formyl-3-methyl-butylcarbamoyl)-3-methyl-butyl]-amide Cbz-L-leu-L-leu-L-leu-CHO MG-132 Z-Leu-Leu-Leu-H benzyl (S)-4-methyl-1-((S)-4-methyl-1-((S)-4-methyl-1-oxopentan-2-ylamino)-1-oxopentan-2-ylamino)-1-oxopentan-2-ylcarbamate benzyloxycarbonyl-Leu-Leu-leucinal {1-[(S)-(S)-1-((S)-1-Formyl-3-methyl-butylcarbamoyl)-3-methyl-butylcarbamoyl]-3-methyl-butyl}-carbamic acid benzyl ester | {1-[1-(1-Formyl-3-methyl-butylcarbamoyl)-3-methyl-butylcarbamoyl]-3-methyl-butyl}-carbamic acid benzyl ester
TypeSmall organic molecule
Emp. Form.C26H41N3O5
Mol. Mass.475.6208
SMILESCC(C)C[C@H](NC(=O)[C@H](CC(C)C)NC(=O)[C@H](CC(C)C)NC(=O)OCc1ccccc1)C=O