Reaction Details
TargetKiSS-1 receptor
LigandBDBM50045513
Substrate/Competitorn/a
Meas. Tech.ChEMBL_1618632 (CHEMBL3860801)
EC50 0.960000±n/a nM
Citation Nishizawa, NTakatsu, YKumano, SKiba, ABan, JTsutsumi, SMatsui, HMatsumoto, SIYamaguchi, MIkeda, YKusaka, MOhtaki, TItoh, FAsami, T Design and Synthesis of an Investigational Nonapeptide KISS1 Receptor (KISS1R) Agonist, Ac-d-Tyr-Hydroxyproline (Hyp)-Asn-Thr-Phe-azaGly-Leu-Arg(Me)-Trp-NH J Med Chem59:8804-8811 (2016) 
 
KiSS-1 receptor
Name:KiSS-1 receptor
Type:G Protein-Coupled Receptor (GPCR)
Mol. Mass.:42613.79
Organism:Homo sapiens (Human)
Description:Binding assay was performed using membranes from the CHO cell transfectants.
Residue:398
BDBM50045513
NameBDBM50045513
Synonyms:Kisspeptin-10
TypeSmall organic molecule
Emp. Form.C63H83N17O14
Mol. Mass.1302.4386
SMILESCC(C)C[C@H](NC(=O)CNC(=O)[C@H](Cc1ccccc1)NC(=O)[C@H](CO)NC(=O)[C@H](CC(N)=O)NC(=O)[C@H](Cc1c[nH]c2ccccc12)NC(=O)[C@H](CC(N)=O)NC(=O)[C@@H](N)Cc1ccc(O)cc1)C(=O)N[C@@H](CCCNC(N)=N)C(=O)N[C@@H](Cc1ccccc1)C(N)=O