Reaction Details
TargetAcetyl-CoA carboxylase 2
LigandBDBM50198328
Substrate/Competitorn/a
Meas. Tech.ChEBML_1620629
IC50 48±n/a nM
Citation Okazaki, SNoguchi-Yachide, TSakai, TIshikawa, MMakishima, MHashimoto, YYamaguchi, T Discovery of N-(1-(3-(4-phenoxyphenyl)-1,2,4-oxadiazol-5-yl)ethyl)acetamides as novel acetyl-CoA carboxylase 2 (ACC2) inhibitors with peroxisome proliferator-activated receptora/d (PPARa/d) dual agonistic activity. Bioorg Med Chem24:5258-5269 (2016) 
 
Acetyl-CoA carboxylase 2
Name:Acetyl-CoA carboxylase 2
Type:Protein
Mol. Mass.:276535.21
Organism:Homo sapiens (Human)
Description:O00763
Residue:2458
BDBM50198328
NameBDBM50198328
Synonyms:CHEMBL3911590
TypeSmall organic molecule
Emp. Form.C24H21N3O4
Mol. Mass.415.4412
SMILESCC(NC(C)=O)c1nc(no1)-c1ccc(Oc2ccc(Oc3ccccc3)cc2)cc1