Reaction Details
TargetAcetyl-CoA carboxylase 2
LigandBDBM50198329
Substrate/Competitorn/a
Meas. Tech.ChEBML_1620629
IC50 290±n/a nM
Citation Okazaki, SNoguchi-Yachide, TSakai, TIshikawa, MMakishima, MHashimoto, YYamaguchi, T Discovery of N-(1-(3-(4-phenoxyphenyl)-1,2,4-oxadiazol-5-yl)ethyl)acetamides as novel acetyl-CoA carboxylase 2 (ACC2) inhibitors with peroxisome proliferator-activated receptora/d (PPARa/d) dual agonistic activity. Bioorg Med Chem24:5258-5269 (2016) 
 
Acetyl-CoA carboxylase 2
Name:Acetyl-CoA carboxylase 2
Type:Protein
Mol. Mass.:276535.21
Organism:Homo sapiens (Human)
Description:O00763
Residue:2458
BDBM50198329
NameBDBM50198329
Synonyms:CHEMBL3981588
TypeSmall organic molecule
Emp. Form.C18H17N3O3
Mol. Mass.323.3459
SMILESCC(NC(C)=O)c1nc(no1)-c1ccc(Oc2ccccc2)cc1