Reaction Details
TargetC-C chemokine receptor type 10
LigandBDBM50198920
Substrate/Competitorn/a
Meas. Tech.ChEMBL_1621022 (CHEMBL3863305)
IC50 13±n/a nM
Citation Abeywardane, ACaviness, GChoi, YCogan, DGao, AGoldberg, DHeim-Riether, AJeanfavre, DKlein, EKowalski, JAMao, WMiller, CMoss, NRamsden, PRaymond, ESkow, DSmith-Keenan, LSnow, RJWu, FWu, JPYu, Y N-Arylsulfonyl-a-amino carboxamides are potent and selective inhibitors of the chemokine receptor CCR10 that show efficacy in the murine DNFB model of contact hypersensitivity. Bioorg Med Chem Lett26:5277-5283 (2016) 
 
C-C chemokine receptor type 10
Name:C-C chemokine receptor type 10
Type:PROTEIN
Mol. Mass.:38433.43
Organism:Homo sapiens (Human)
Description:ChEMBL_105617
Residue:362
BDBM50198920
NameBDBM50198920
Synonyms:CHEMBL3951018
TypeSmall organic molecule
Emp. Form.C21H25Cl2N5O3S
Mol. Mass.498.426
SMILESCC1CCN(CC1)C(=O)C(CCn1cccc1C#N)NS(=O)(=O)c1cc(Cl)c(N)c(Cl)c1