Reaction Details
TargetC-C chemokine receptor type 10
LigandBDBM50199089
Substrate/Competitorn/a
Meas. Tech.ChEMBL_1621016 (CHEMBL3863299)
IC50<10000±n/a nM
Citation Abeywardane, ACaviness, GChoi, YCogan, DGao, AGoldberg, DHeim-Riether, AJeanfavre, DKlein, EKowalski, JAMao, WMiller, CMoss, NRamsden, PRaymond, ESkow, DSmith-Keenan, LSnow, RJWu, FWu, JPYu, Y N-Arylsulfonyl-a-amino carboxamides are potent and selective inhibitors of the chemokine receptor CCR10 that show efficacy in the murine DNFB model of contact hypersensitivity. Bioorg Med Chem Lett26:5277-5283 (2016) 
 
C-C chemokine receptor type 10
Name:C-C chemokine receptor type 10
Type:PROTEIN
Mol. Mass.:38433.43
Organism:Homo sapiens (Human)
Description:ChEMBL_105617
Residue:362
BDBM50199089
NameBDBM50199089
Synonyms:CHEMBL3928968
TypeSmall organic molecule
Emp. Form.C19H21Cl2N5O3S
Mol. Mass.470.373
SMILESNc1c(Cl)cc(cc1Cl)S(=O)(=O)NC(CCn1cccc1C#N)C(=O)N1CCCC1