Reaction Details
TargetC-C chemokine receptor type 10
LigandBDBM50198998
Substrate/Competitorn/a
Meas. Tech.ChEMBL_1621018 (CHEMBL3863301)
IC50<19953±n/a nM
Citation Abeywardane, ACaviness, GChoi, YCogan, DGao, AGoldberg, DHeim-Riether, AJeanfavre, DKlein, EKowalski, JAMao, WMiller, CMoss, NRamsden, PRaymond, ESkow, DSmith-Keenan, LSnow, RJWu, FWu, JPYu, Y N-Arylsulfonyl-a-amino carboxamides are potent and selective inhibitors of the chemokine receptor CCR10 that show efficacy in the murine DNFB model of contact hypersensitivity. Bioorg Med Chem Lett26:5277-5283 (2016) 
 
C-C chemokine receptor type 10
Name:C-C chemokine receptor type 10
Type:PROTEIN
Mol. Mass.:38922.81
Organism:Mus musculus
Description:ChEMBL_116946
Residue:362
BDBM50198998
NameBDBM50198998
Synonyms:CHEMBL3964547
TypeSmall organic molecule
Emp. Form.C19H24Cl3N5O3S
Mol. Mass.508.85
SMILESCC1CCN(CC1)C(=O)C(CCn1ccnc1Cl)NS(=O)(=O)c1cc(Cl)c(N)c(Cl)c1