Reaction Details
TargetIntegrin alpha-V/beta-1
LigandBDBM50199345
Substrate/Competitorn/a
Meas. Tech.ChEMBL_1621498 (CHEMBL3863781)
IC50 0.063096±n/a nM
Citation Reed, NITang, YZMcIntosh, JWu, YMolnar, KSCivitavecchia, ASheppard, DDeGrado, WFJo, H Exploring ACS Med Chem Lett7:902-907 (2016) 
 
Integrin alpha-V/beta-1
Name:Integrin alpha-V/beta-1
Type:Enzyme
Mol. Mass.:n/a
Description:n/a
Components:This complex has 2 components.
Component 1
Name:Integrin alpha-V
Synonyms:ITAV_HUMAN Integrin alpha-V/alpha-5 VNRA Vitronectin receptor | Vitronectin receptor subunit alpha
Type:PROTEIN
Mol. Mass.:116024.92
Organism:Homo sapiens (Human)
Description:ChEMBL_582336
Residue:1048
Component 2
Name:Integrin beta-1
Synonyms:CD_antigen=CD29 Fibronectin receptor beta GPIIA ITGB1 MDF2 | MSK12
Type:Enzyme
Mol. Mass.:88400.38
Organism:Homo sapiens (Human)
Description:P05556
Residue:798
BDBM50199345
NameBDBM50199345
Synonyms:CHEMBL3893700 | US10131658, Compound 201
TypeSmall organic molecule
Emp. Form.C28H30N6O6S
Mol. Mass.578.639
SMILESNC(=N)Nc1cccc(c1)C(=O)Nc1ccc(C[C@H](NC(=O)[C@@H]2CCCN2S(=O)(=O)c2ccccc2)C(O)=O)cc1