Reaction Details
TargetHistone-lysine N-methyltransferase EHMT2
LigandBDBM50202440
Substrate/Competitorn/a
Meas. Tech.ChEBML_1624147
IC50 6500±n/a nM
Citation Kondengaden, SMLuo, LFHuang, KZhu, MZang, LBataba, EWang, RLuo, CWang, BLi, KKWang, PG Discovery of novel small molecule inhibitors of lysine methyltransferase G9a and their mechanism in leukemia cell lines. Eur J Med Chem122:382-393 (2016) 
 
Histone-lysine N-methyltransferase EHMT2
Name:Histone-lysine N-methyltransferase EHMT2
Type:PROTEIN
Mol. Mass.:138019.66
Organism:Mus musculus
Description:ChEMBL_1294296
Residue:1263
BDBM50202440
NameBDBM50202440
Synonyms:CHEMBL3933828
TypeSmall organic molecule
Emp. Form.C30H31F6N3O2
Mol. Mass.579.5765
SMILESCN(C)C(=O)Nc1ccc(CN2CCC(CC2)C(O)(c2ccc(cc2)C(F)(F)F)c2ccc(cc2)C(F)(F)F)cc1