Reaction Details
TargetArachidonate 5-lipoxygenase-activating protein
LigandBDBM50202473
Substrate/Competitorn/a
Meas. Tech.ChEMBL_1624271 (CHEMBL3866683)
IC50 12±n/a nM
Citation Levent, SGerstmeier, JOlgaç, ANikels, FGarscha, UCarotti, AMacchiarulo, AWerz, OBanoglu, EÇaliskan, B Synthesis and biological evaluation of C(5)-substituted derivatives of leukotriene biosynthesis inhibitor BRP-7. Eur J Med Chem122:510-519 (2016) 
 
Arachidonate 5-lipoxygenase-activating protein
Name:Arachidonate 5-lipoxygenase-activating protein
Type:Enzyme
Mol. Mass.:18159.90
Organism:Homo sapiens (Human)
Description:P20292
Residue:161
BDBM50202473
NameBDBM50202473
Synonyms:CHEMBL3954390
TypeSmall organic molecule
Emp. Form.C27H26ClN3
Mol. Mass.427.968
SMILESCC(C)Cc1ccc(cc1)C(C)c1nc2cc(ccc2n1Cc1ccccc1Cl)C#N