Reaction Details
TargetArachidonate 5-lipoxygenase-activating protein
LigandBDBM50202474
Substrate/Competitorn/a
Meas. Tech.ChEMBL_1624267 (CHEMBL3866679)
IC50 150±n/a nM
Citation Levent, SGerstmeier, JOlgaç, ANikels, FGarscha, UCarotti, AMacchiarulo, AWerz, OBanoglu, EÇaliskan, B Synthesis and biological evaluation of C(5)-substituted derivatives of leukotriene biosynthesis inhibitor BRP-7. Eur J Med Chem122:510-519 (2016) 
 
Arachidonate 5-lipoxygenase-activating protein
Name:Arachidonate 5-lipoxygenase-activating protein
Type:Enzyme
Mol. Mass.:18159.90
Organism:Homo sapiens (Human)
Description:P20292
Residue:161
BDBM50202474
NameBDBM50202474
Synonyms:CHEMBL3897558
TypeSmall organic molecule
Emp. Form.C33H32F3N3O
Mol. Mass.543.6219
SMILESCC(C)Cc1ccc(cc1)C(C)c1nc2cc(OCc3ccccn3)ccc2n1Cc1ccccc1C(F)(F)F