Reaction Details
TargetG protein-activated inward rectifier potassium channel 4
LigandBDBM50202481
Substrate/Competitorn/a
Meas. Tech.ChEMBL_1624369 (CHEMBL3866781)
IC50 4900±n/a nM
Citation Vasas, AForgo, POrvos, PTálosi, LCsorba, APinke, GHohmann, J Myrsinane, Premyrsinane, and Cyclomyrsinane Diterpenes from Euphorbia falcata as Potassium Ion Channel Inhibitors with Selective G Protein-Activated Inwardly Rectifying Ion Channel (GIRK) Blocking Effects. J Nat Prod79:1990-2004 (2016) 
 
G protein-activated inward rectifier potassium channel 4
Name:G protein-activated inward rectifier potassium channel 4
Type:PROTEIN
Mol. Mass.:47658.06
Organism:Homo sapiens (Human)
Description:ChEMBL_107914
Residue:419
BDBM50202481
NameBDBM50202481
Synonyms:CHEMBL3901192
TypeSmall organic molecule
Emp. Form.C39H49NO14
Mol. Mass.755.8047
SMILES[H][C@@]12C[C@](C)(OC(C)=O)[C@]1([H])[C@@]1([H])[C@@]3(C)OC[C@@]1([C@H](OC(C)=O)[C@@]1([H])[C@@H](OC(=O)c4cccnc4)[C@@H](C)C[C@]1(OC(C)=O)[C@H]3OC(C)=O)C(=O)[C@@H]2OC(=O)C(C)CC