Reaction Details
TargetHistamine H1 receptor
LigandBDBM50202828
Substrate/Competitorn/a
Meas. Tech.ChEMBL_1624854 (CHEMBL3867266)
Ki 32±n/a nM
Citation Kuhne, SKooistra, AJBosma, RBortolato, AWijtmans, MVischer, HFMason, JSde Graaf, Cde Esch, IJLeurs, R Identification of Ligand Binding Hot Spots of the Histamine H J Med Chem59:9047-9061 (2016) 
 
Histamine H1 receptor
Name:Histamine H1 receptor
Type:G Protein-Coupled Receptor (GPCR)
Mol. Mass.:55808.72
Organism:Homo sapiens (Human)
Description:Cell pellets from SK-N-MC cells transfected with human H1 receptor were used in binding assay.
Residue:487
BDBM50202828
NameBDBM50202828
Synonyms:CHEMBL3964404
TypeSmall organic molecule
Emp. Form.C21H25NO5
Mol. Mass.371.4269
SMILESOC(=O)\C=C\C(O)=O.CNCCCOc1ccccc1Cc1ccccc1