Reaction Details
TargetCathepsin K
LigandBDBM50201793
Substrate/Competitorn/a
Meas. Tech.ChEMBL_1625295 (CHEMBL3867764)
Ki 105±n/a nM
Citation Aguda, AHLavallee, VCheng, PBott, TMMeimetis, LGLaw, SNguyen, NTWilliams, DEKaleta, JVillanueva, IDavies, JAndersen, RJBrayer, GDBrömme, D Affinity Crystallography: A New Approach to Extracting High-Affinity Enzyme Inhibitors from Natural Extracts. J Nat Prod79:1962-70 (2016) 
 
Cathepsin K
Name:Cathepsin K
Type:Enzyme
Mol. Mass.:36975.68
Organism:Homo sapiens (Human)
Description:P43235
Residue:329
BDBM50201793
NameBDBM50201793
Synonyms:CHEMBL3899320
TypeSmall organic molecule
Emp. Form.C27H44N10O6
Mol. Mass.604.7017
SMILESCC(C)[C@H](NC(=O)[C@H](CCCNC(N)=N)NC(=O)N[C@@H](Cc1ccccc1)C(O)=O)C(=O)NC1CCCN(C1O)C(N)=N