Reaction Details
TargetM-phase inducer phosphatase 2
LigandBDBM50201802
Substrate/Competitorn/a
Meas. Tech.ChEMBL_1625486 (CHEMBL3867955)
IC50 2740000±n/a nM
Citation Meng, GZheng, MWang, MTong, JGe, WZhang, JZheng, ALi, JGao, LLi, J Design and synthesis of new potent PTP1B inhibitors with the skeleton of 2-substituted imino-3-substituted-5-heteroarylidene-1,3-thiazolidine-4-one: Part I. Eur J Med Chem122:756-769 (2016) 
 
M-phase inducer phosphatase 2
Name:M-phase inducer phosphatase 2
Type:Protein
Mol. Mass.:64985.27
Organism:Homo sapiens (Human)
Description:n/a
Residue:580
BDBM50201802
NameBDBM50201802
Synonyms:CHEMBL3981128
TypeSmall organic molecule
Emp. Form.C27H27N3O5S
Mol. Mass.505.585
SMILESCCOC(=O)c1c(C)[nH]c(\C=C2/S\C(=N/c3ccc(OC)cc3)N(C2=O)c2ccc(OC)cc2)c1C