Reaction Details
TargetBeta-galactosidase
LigandBDBM50204110
Substrate/Competitorn/a
Meas. Tech.ChEMBL_1626901 (CHEMBL3869422)
IC50 572000±n/a nM
Citation Miyawaki, SHirokami, YKinami, KHoshino, MMinehira, DMiyamoto, DNash, RJFleet, GWAdachi, IToyooka, NKato, A Strategy for designing selectivea-l-rhamnosidase inhibitors: Synthesis and biological evaluation of l-DMDP cyclic isothioureas. Bioorg Med Chem25:107-115 (2017) 
 
Beta-galactosidase
Name:Beta-galactosidase
Type:Protein
Mol. Mass.:73420.88
Organism:Bos taurus (Bovine)
Description:n/a
Residue:653
BDBM50204110
NameBDBM50204110
Synonyms:CHEMBL3905255
TypeSmall organic molecule
Emp. Form.C13H26N2O4S
Mol. Mass.306.422
SMILESCCCCCCNC(=S)N1[C@@H](CO)[C@H](O)[C@@H](O)[C@@H]1CO