Reaction Details
TargetBeta-galactosidase
LigandBDBM50204210
Substrate/Competitorn/a
Meas. Tech.ChEMBL_1626901 (CHEMBL3869422)
IC50 61000±n/a nM
Citation Miyawaki, SHirokami, YKinami, KHoshino, MMinehira, DMiyamoto, DNash, RJFleet, GWAdachi, IToyooka, NKato, A Strategy for designing selectivea-l-rhamnosidase inhibitors: Synthesis and biological evaluation of l-DMDP cyclic isothioureas. Bioorg Med Chem25:107-115 (2017) 
 
Beta-galactosidase
Name:Beta-galactosidase
Type:Protein
Mol. Mass.:73420.88
Organism:Bos taurus (Bovine)
Description:n/a
Residue:653
BDBM50204210
NameBDBM50204210
Synonyms:CHEMBL3970812
TypeSmall organic molecule
Emp. Form.C17H34N2O4S
Mol. Mass.362.528
SMILESCCCCCCCCCCNC(=S)N1[C@@H](CO)[C@H](O)[C@@H](O)[C@@H]1CO