Reaction Details
TargetAndrogen receptor
LigandBDBM50204242
Substrate/Competitorn/a
Meas. Tech.ChEMBL_1627004 (CHEMBL3869525)
Ki 5.0±n/a nM
Citation Shan, WBalog, ANation, AZhu, XChen, JCvijic, MEGeng, JRizzo, CASpires, TAttar, RMObermeier, MTraeger, SDai, JZhang, YGalella, MTrainor, GVite, GDGavai, AV [2.2.1]-Bicyclic sultams as potent androgen receptor antagonists. Bioorg Med Chem Lett26:5707-5711 (2016) 
 
Androgen receptor
Name:Androgen receptor
Type:Receptor
Mol. Mass.:99185.27
Organism:Homo sapiens (Human)
Description:CHO cells were stably transfected with human AR gene.
Residue:920
BDBM50204242
NameBDBM50204242
Synonyms:CHEMBL3902310
TypeSmall organic molecule
Emp. Form.C18H17F4N3O3S
Mol. Mass.431.404
SMILES[H][C@]12C[C@H](F)[C@]([H])(C1)[C@]1(C(=O)NC)[C@@]2([H])CN(c2ccc(C#N)c(c2)C(F)(F)F)S1(=O)=O