Reaction Details
TargetAndrogen receptor
LigandBDBM50204250
Substrate/Competitorn/a
Meas. Tech.ChEMBL_1627005 (CHEMBL3869526)
IC50 91±n/a nM
Citation Shan, WBalog, ANation, AZhu, XChen, JCvijic, MEGeng, JRizzo, CASpires, TAttar, RMObermeier, MTraeger, SDai, JZhang, YGalella, MTrainor, GVite, GDGavai, AV [2.2.1]-Bicyclic sultams as potent androgen receptor antagonists. Bioorg Med Chem Lett26:5707-5711 (2016) 
 
Androgen receptor
Name:Androgen receptor
Type:Receptor
Mol. Mass.:99185.27
Organism:Homo sapiens (Human)
Description:CHO cells were stably transfected with human AR gene.
Residue:920
BDBM50204250
NameBDBM50204250
Synonyms:CHEMBL3949176
TypeSmall organic molecule
Emp. Form.C17H16F4N2O2S
Mol. Mass.388.38
SMILES[H][C@]12C[C@H](F)[C@]([H])(C1)[C@]1(C)[C@@]2([H])CN(c2ccc(C#N)c(c2)C(F)(F)F)S1(=O)=O