Reaction Details
TargetAndrogen receptor
LigandBDBM50204247
Substrate/Competitorn/a
Meas. Tech.ChEMBL_1627005 (CHEMBL3869526)
IC50 106±n/a nM
Citation Shan, WBalog, ANation, AZhu, XChen, JCvijic, MEGeng, JRizzo, CASpires, TAttar, RMObermeier, MTraeger, SDai, JZhang, YGalella, MTrainor, GVite, GDGavai, AV [2.2.1]-Bicyclic sultams as potent androgen receptor antagonists. Bioorg Med Chem Lett26:5707-5711 (2016) 
 
Androgen receptor
Name:Androgen receptor
Type:Receptor
Mol. Mass.:99185.27
Organism:Homo sapiens (Human)
Description:CHO cells were stably transfected with human AR gene.
Residue:920
BDBM50204247
NameBDBM50204247
Synonyms:CHEMBL3920247
TypeSmall organic molecule
Emp. Form.C17H17F3N2O3S
Mol. Mass.386.389
SMILES[H][C@]12C[C@H](O)[C@]([H])(C1)[C@]1(C)[C@@]2([H])CN(c2ccc(C#N)c(c2)C(F)(F)F)S1(=O)=O