Reaction Details
TargetMetabotropic glutamate receptor 3
LigandBDBM50204261
Substrate/Competitorn/a
Meas. Tech.ChEMBL_1627093 (CHEMBL3869614)
Ki 2.7±n/a nM
Citation Dressman, BATromiczak, EGChappell, MDTripp, AEQuimby, SJVetman, TFivush, AMMatt, JJaramillo, CLi, RKhilevich, ABlanco, MJSmith, SCCarpintero, Mde Diego, JEBarberis, MGarcía-Cerrada, SSoriano, JFSchkeryantz, JMWitkin, JMWafford, KASeidel, WBritton, TOvershiner, CDLi, XWang, XSHeinz, BACatlow, JTSwanson, SBedwell, DOrnstein, PLMitch, CH Novel bicyclo[3.1.0]hexane analogs as antagonists of metabotropic glutamate 2/3 receptors for the treatment of depression. Bioorg Med Chem Lett26:5663-5668 (2016) 
 
Metabotropic glutamate receptor 3
Name:Metabotropic glutamate receptor 3
Type:Enzyme Catalytic Domain
Mol. Mass.:98889.09
Organism:Homo sapiens (Human)
Description:metabotropic glutamate 1c 0 HUMAN::Q14832
Residue:879
BDBM50204261
NameBDBM50204261
Synonyms:CHEMBL3969063
TypeSmall organic molecule
Emp. Form.C17H16Cl2N4O5S
Mol. Mass.459.304
SMILES[H][C@]12[C@H](C(O)=O)[C@@]1([H])[C@@](N)([C@H](OCc1ccc(Cl)c(Cl)c1)[C@H]2Sc1nc[nH]n1)C(O)=O