Reaction Details
TargetMetabotropic glutamate receptor 2
LigandBDBM50204257
Substrate/Competitorn/a
Meas. Tech.ChEMBL_1627028 (CHEMBL3869549)
Ki 20±n/a nM
Citation Dressman, BATromiczak, EGChappell, MDTripp, AEQuimby, SJVetman, TFivush, AMMatt, JJaramillo, CLi, RKhilevich, ABlanco, MJSmith, SCCarpintero, Mde Diego, JEBarberis, MGarcía-Cerrada, SSoriano, JFSchkeryantz, JMWitkin, JMWafford, KASeidel, WBritton, TOvershiner, CDLi, XWang, XSHeinz, BACatlow, JTSwanson, SBedwell, DOrnstein, PLMitch, CH Novel bicyclo[3.1.0]hexane analogs as antagonists of metabotropic glutamate 2/3 receptors for the treatment of depression. Bioorg Med Chem Lett26:5663-5668 (2016) 
 
Metabotropic glutamate receptor 2
Name:Metabotropic glutamate receptor 2
Type:Enzyme
Mol. Mass.:95584.88
Organism:Homo sapiens (Human)
Description:Q14416
Residue:872
BDBM50204257
NameBDBM50204257
Synonyms:CHEMBL3947221
TypeSmall organic molecule
Emp. Form.C15H15Cl2NO6
Mol. Mass.376.189
SMILES[H][C@]12[C@H](C(O)=O)[C@@]1([H])[C@@](N)([C@H](OCc1ccc(Cl)c(Cl)c1)[C@H]2O)C(O)=O