Reaction Details
TargetTyrosine-protein kinase SYK
LigandBDBM620222
Substrate/Competitorn/a
Meas. Tech.ChEMBL_1627193 (CHEMBL3869714)
IC50 0.900000±n/a nM
Citation Lam, BArikawa, YCramlett, JDong, Qde Jong, RFeher, VGrimshaw, CEFarrell, PJHoffman, IDJennings, AJones, BMatuszkiewicz, JMiura, JMiyake, HNatala, SRShi, LTakahashi, MTaylor, EWyrick, CYano, JZalevsky, JNie, Z Discovery of TAK-659 an orally available investigational inhibitor of Spleen Tyrosine Kinase (SYK). Bioorg Med Chem Lett26:5947-5950 (2016) 
 
Tyrosine-protein kinase SYK
Name:Tyrosine-protein kinase SYK
Type:Enzyme
Mol. Mass.:72079.99
Organism:Homo sapiens (Human)
Description:P43405
Residue:635
BDBM620222
NameBDBM620222
Synonyms:BDBM50204292 | US20230295171, Example 82
TypeSmall organic molecule
Emp. Form.C23H27N7O
Mol. Mass.417.5068
SMILESCc1cccc(Nc2nc(N[C@@H]3CCCC[C@@H]3N)c(-c3cn[nH]c3)c3CNC(=O)c23)c1