Reaction Details
TargetTyrosine-protein kinase SYK
LigandBDBM50204294
Substrate/Competitorn/a
Meas. Tech.ChEMBL_1627194 (CHEMBL3869715)
EC50 35±n/a nM
Citation Lam, BArikawa, YCramlett, JDong, Qde Jong, RFeher, VGrimshaw, CEFarrell, PJHoffman, IDJennings, AJones, BMatuszkiewicz, JMiura, JMiyake, HNatala, SRShi, LTakahashi, MTaylor, EWyrick, CYano, JZalevsky, JNie, Z Discovery of TAK-659 an orally available investigational inhibitor of Spleen Tyrosine Kinase (SYK). Bioorg Med Chem Lett26:5947-5950 (2016) 
 
Tyrosine-protein kinase SYK
Name:Tyrosine-protein kinase SYK
Type:Enzyme
Mol. Mass.:72079.99
Organism:Homo sapiens (Human)
Description:P43405
Residue:635
BDBM50204294
NameBDBM50204294
Synonyms:CHEMBL3943295 | US20230295171, Example 8
TypeSmall organic molecule
Emp. Form.C19H24N6O
Mol. Mass.352.4335
SMILESCc1cccc(Nc2nc(N[C@@H]3CCCC[C@@H]3N)nc3CNC(=O)c23)c1