Reaction Details
TargetTyrosine-protein kinase JAK3
LigandBDBM50204290
Substrate/Competitorn/a
Meas. Tech.ChEMBL_1627201 (CHEMBL3869722)
IC50 114±n/a nM
Citation Lam, BArikawa, YCramlett, JDong, Qde Jong, RFeher, VGrimshaw, CEFarrell, PJHoffman, IDJennings, AJones, BMatuszkiewicz, JMiura, JMiyake, HNatala, SRShi, LTakahashi, MTaylor, EWyrick, CYano, JZalevsky, JNie, Z Discovery of TAK-659 an orally available investigational inhibitor of Spleen Tyrosine Kinase (SYK). Bioorg Med Chem Lett26:5947-5950 (2016) 
 
Tyrosine-protein kinase JAK3
Name:Tyrosine-protein kinase JAK3
Type:Protein
Mol. Mass.:125111.08
Organism:Homo sapiens (Human)
Description:P52333
Residue:1124
BDBM50204290
NameBDBM50204290
Synonyms:CHEMBL3979920 US20230295171, Example 102
TypeSmall organic molecule
Emp. Form.C17H21FN6O
Mol. Mass.344.3866
SMILESCn1cc(cn1)-c1nc(N[C@@H]2CCCC[C@@H]2N)c(F)c2CNC(=O)c12