Reaction Details
TargetCysteine protease ATG4B
LigandBDBM80861
Substrate/Competitorn/a
Meas. Tech.ChEMBL_1628065 (CHEMBL3870650)
IC50 316±n/a nM
Citation Cleenewerck, MGrootaert, MOJGladysz, RAdriaenssens, YRoelandt, RJoossens, JLambeir, AMDe Meyer, GRYDeclercq, WAugustyns, KMartinet, WVan der Veken, P Inhibitor screening and enzymatic activity determination for autophagy target Atg4B using a gel electrophoresis-based assay. Eur J Med Chem123:631-638 (2016) 
 
Cysteine protease ATG4B
Name:Cysteine protease ATG4B
Type:Enzyme Catalytic Domain
Mol. Mass.:44279.79
Organism:Homo sapiens (Human)
Description:gi_47132611
Residue:393
BDBM80861
NameBDBM80861
Synonyms:4-[2-(2-Cyclohexyl-5,6-dimethyl-thieno[2,3-d]pyrimidin-4-ylsulfanyl)-acetyl]-3,4-dihydro-1H-quinoxalin-2-one 4-[2-(2-cyclohexyl-5,6-dimethylthieno[2,3-d]pyrimidin-4-yl)sulfanylacetyl]-1,3-dihydroquinoxalin-2-one 4-[2-[(2-cyclohexyl-5,6-dimethyl-thieno[2,3-d]pyrimidin-4-yl)thio]acetyl]-1,3-dihydroquinoxalin-2-one SMR000173088 | cid_3203918
TypeSmall organic molecule
Emp. Form.C24H26N4O2S2
Mol. Mass.466.619
SMILESCc1sc2nc(nc(SCC(=O)N3CC(=O)Nc4ccccc34)c2c1C)C1CCCCC1