Reaction Details
TargetHistamine H3 receptor
LigandBDBM50205359
Substrate/Competitorn/a
Meas. Tech.ChEMBL_1628378 (CHEMBL3870963)
Ki 0.316228±n/a nM
Citation Procopiou, PAAncliff, RAGore, PMHancock, APHodgson, STHolmes, DSKeeling, SPLooker, BEParr, NARowedder, JESlack, RJ The discovery of quinoline based single-ligand human H Bioorg Med Chem Lett26:5855-5859 (2016) 
 
Histamine H3 receptor
Name:Histamine H3 receptor
Type:G Protein-Coupled Receptor (GPCR)
Mol. Mass.:48691.47
Organism:Homo sapiens (Human)
Description:Binding assays were using CHO cells stably expressing hH3R receptors.
Residue:445
BDBM50205359
NameBDBM50205359
Synonyms:CHEMBL3917428
TypeSmall organic molecule
Emp. Form.C40H50N4O3
Mol. Mass.634.85
SMILESOC(=O)CCc1ccc2cc(Cc3ccccc3)cc(N3CCN(CCc4ccc(OCCCN5CCCCCC5)cc4)CC3)c2n1