Reaction Details
TargetAlpha-1A adrenergic receptor
LigandBDBM50205361
Substrate/Competitorn/a
Meas. Tech.ChEMBL_1628379 (CHEMBL3870964)
Ki 79±n/a nM
Citation Procopiou, PAAncliff, RAGore, PMHancock, APHodgson, STHolmes, DSKeeling, SPLooker, BEParr, NARowedder, JESlack, RJ The discovery of quinoline based single-ligand human H Bioorg Med Chem Lett26:5855-5859 (2016) 
 
Alpha-1A adrenergic receptor
Name:Alpha-1A adrenergic receptor
Type:Cell-surface receptors
Mol. Mass.:51511.67
Organism:Homo sapiens (Human)
Description:P35348
Residue:466
BDBM50205361
NameBDBM50205361
Synonyms:CHEMBL3893197
TypeSmall organic molecule
Emp. Form.C32H44N4O
Mol. Mass.500.718
SMILESC(CCc1ccc(OCCCN2CCCCCC2)cc1)CN1CCN(CC1)c1cccc2cccnc12