Reaction Details
TargetAlpha-1B adrenergic receptor
LigandBDBM50205353
Substrate/Competitorn/a
Meas. Tech.ChEMBL_1628380 (CHEMBL3870965)
Ki 16±n/a nM
Citation Procopiou, PAAncliff, RAGore, PMHancock, APHodgson, STHolmes, DSKeeling, SPLooker, BEParr, NARowedder, JESlack, RJ The discovery of quinoline based single-ligand human H Bioorg Med Chem Lett26:5855-5859 (2016) 
 
Alpha-1B adrenergic receptor
Name:Alpha-1B adrenergic receptor
Type:Enzyme
Mol. Mass.:56862.13
Organism:Homo sapiens (Human)
Description:P35368
Residue:520
BDBM50205353
NameBDBM50205353
Synonyms:CHEMBL3947980
TypeSmall organic molecule
Emp. Form.C30H40N4O
Mol. Mass.472.6648
SMILESC(COc1ccc(CCN2CCN(CC2)c2cccc3cccnc23)cc1)CN1CCCCCC1