Reaction Details
TargetHistamine H1 receptor
LigandBDBM50205364
Substrate/Competitorn/a
Meas. Tech.ChEMBL_1628377 (CHEMBL3870962)
Ki 13±n/a nM
Citation Procopiou, PAAncliff, RAGore, PMHancock, APHodgson, STHolmes, DSKeeling, SPLooker, BEParr, NARowedder, JESlack, RJ The discovery of quinoline based single-ligand human H Bioorg Med Chem Lett26:5855-5859 (2016) 
 
Histamine H1 receptor
Name:Histamine H1 receptor
Type:G Protein-Coupled Receptor (GPCR)
Mol. Mass.:55808.72
Organism:Homo sapiens (Human)
Description:Cell pellets from SK-N-MC cells transfected with human H1 receptor were used in binding assay.
Residue:487
BDBM50205364
NameBDBM50205364
Synonyms:CHEMBL3935303
TypeSmall organic molecule
Emp. Form.C33H44N4O3
Mol. Mass.544.7275
SMILESOC(=O)CCc1ccc2cccc(N3CCN(CCc4ccc(OCCCN5CCCCCC5)cc4)CC3)c2n1