Reaction Details
TargetHistamine H3 receptor
LigandBDBM50205367
Substrate/Competitorn/a
Meas. Tech.ChEMBL_1628378 (CHEMBL3870963)
Ki 0.501187±n/a nM
Citation Procopiou, PAAncliff, RAGore, PMHancock, APHodgson, STHolmes, DSKeeling, SPLooker, BEParr, NARowedder, JESlack, RJ The discovery of quinoline based single-ligand human H Bioorg Med Chem Lett26:5855-5859 (2016) 
 
Histamine H3 receptor
Name:Histamine H3 receptor
Type:G Protein-Coupled Receptor (GPCR)
Mol. Mass.:48691.47
Organism:Homo sapiens (Human)
Description:Binding assays were using CHO cells stably expressing hH3R receptors.
Residue:445
BDBM50205367
NameBDBM50205367
Synonyms:CHEMBL3917794
TypeSmall organic molecule
Emp. Form.C31H40N4O3
Mol. Mass.516.6743
SMILESOC(=O)c1ccc2cccc(N3CCN(CCc4ccc(OCCCN5CCCCCC5)cc4)CC3)c2n1