Reaction Details
TargetAlpha-1B adrenergic receptor
LigandBDBM50341447
Substrate/Competitorn/a
Meas. Tech.ChEMBL_1628380 (CHEMBL3870965)
Ki 32±n/a nM
Citation Procopiou, PAAncliff, RAGore, PMHancock, APHodgson, STHolmes, DSKeeling, SPLooker, BEParr, NARowedder, JESlack, RJ The discovery of quinoline based single-ligand human H Bioorg Med Chem Lett26:5855-5859 (2016) 
 
Alpha-1B adrenergic receptor
Name:Alpha-1B adrenergic receptor
Type:Enzyme
Mol. Mass.:56862.13
Organism:Homo sapiens (Human)
Description:P35368
Residue:520
BDBM50341447
NameBDBM50341447
Synonyms:4-[(4-Chlorophenyl)methyl]-2-({(2R)-1-[4-(4-{[3-(hexahydro-1H-azepin-1-yl)propyl]oxy}phenyl)butyl]-2-pyrrolidinyl}methyl)-1(2H)-phthalazinone | CHEMBL1767164
TypeSmall organic molecule
Emp. Form.C39H49ClN4O2
Mol. Mass.641.285
SMILESClc1ccc(Cc2nn(C[C@H]3CCCN3CCCCc3ccc(OCCCN4CCCCCC4)cc3)c(=O)c3ccccc23)cc1