Reaction Details
Target5-hydroxytryptamine receptor 3A
LigandBDBM50206241
Substrate/Competitorn/a
Meas. Tech.ChEMBL_1628644 (CHEMBL3871229)
IC50 7.0±n/a nM
Citation Hill, MDFang, HKing, HDIwuagwu, CIMcDonald, IMCook, JZusi, FCMate, RAKnox, RJPost-Munson, DEaston, AMiller, RLentz, KClarke, WBenitex, YLodge, NZaczek, RDenton, RMorgan, DBristow, LMacor, JEOlson, R Development of 4-Heteroarylamino-1'-azaspiro[oxazole-5,3'-bicyclo[2.2.2]octanes] asa7 Nicotinic Receptor Agonists. ACS Med Chem Lett8:133-137 (2017) 
 
5-hydroxytryptamine receptor 3A
Name:5-hydroxytryptamine receptor 3A
Type:Protein
Mol. Mass.:55283.27
Organism:Homo sapiens (Human)
Description:P46098
Residue:478
BDBM50206241
NameBDBM50206241
Synonyms:CHEMBL3901366
TypeSmall organic molecule
Emp. Form.C17H21N5O
Mol. Mass.311.3815
SMILESCc1cn2cccc2c(NC2=NC[C@@]3(CN4CCC3CC4)O2)n1