Reaction Details
TargetPhosphatidylinositol 4,5-bisphosphate 3-kinase catalytic subunit delta isoform
LigandBDBM50208168
Substrate/Competitorn/a
Meas. Tech.ChEMBL_1632368 (CHEMBL3875074)
IC50 3.8±n/a nM
Citation Erra, MTaltavull, JGréco, ABernal, FJCaturla, JFGràcia, JDomínguez, MSabaté, MParis, SSoria, SHernández, BArmengol, CCabedo, JBravo, MCalama, EMiralpeix, MLehner, MD Discovery of a Potent, Selective, and Orally Available PI3Kd Inhibitor for the Treatment of Inflammatory Diseases. ACS Med Chem Lett8:118-123 (2017) 
 
Phosphatidylinositol 4,5-bisphosphate 3-kinase catalytic subunit delta isoform
Name:Phosphatidylinositol 4,5-bisphosphate 3-kinase catalytic subunit delta isoform
Type:Enzyme Subunit
Mol. Mass.:119489.41
Organism:Homo sapiens (Human)
Description:O00329
Residue:1044
BDBM50208168
NameBDBM50208168
Synonyms:CHEMBL3924058
TypeSmall organic molecule
Emp. Form.C19H15FN8O
Mol. Mass.390.3738
SMILESC[C@H](Nc1ncnc(N)c1C#N)c1nn2ccc(F)c2c(=O)n1-c1ccccc1