Reaction Details
TargetDual specificity mitogen-activated protein kinase kinase 1
LigandBDBM50209654
Substrate/Competitorn/a
Meas. Tech.ChEMBL_1633897 (CHEMBL3876689)
IC50>10000±n/a nM
Citation Tan, LGurbani, DWeisberg, ELHunter, JCLi, LJones, DSFicarro, SBMowafy, STam, CPRao, SDu, GGriffin, JDSorger, PKMarto, JAWestover, KDGray, NS Structure-guided development of covalent TAK1 inhibitors. Bioorg Med Chem25:838-846 (2017) 
 
Dual specificity mitogen-activated protein kinase kinase 1
Name:Dual specificity mitogen-activated protein kinase kinase 1
Type:Other Protein Type
Mol. Mass.:43439.03
Organism:Homo sapiens (Human)
Description:Full-length human MEK-1 was generated by PCR and purified as a fusion protein from Escherichia coli lysates.
Residue:393
BDBM50209654
NameBDBM50209654
Synonyms:CHEMBL3884614
TypeSmall organic molecule
Emp. Form.C24H27ClN6O2
Mol. Mass.466.963
SMILESCCC(=O)Nc1ccccc1Oc1nc(Nc2ccc(cc2)N2CCN(C)CC2)ncc1Cl