Reaction Details
TargetDual specificity mitogen-activated protein kinase kinase 1
LigandBDBM50209653
Substrate/Competitorn/a
Meas. Tech.ChEMBL_1633897 (CHEMBL3876689)
IC50 11±n/a nM
Citation Tan, LGurbani, DWeisberg, ELHunter, JCLi, LJones, DSFicarro, SBMowafy, STam, CPRao, SDu, GGriffin, JDSorger, PKMarto, JAWestover, KDGray, NS Structure-guided development of covalent TAK1 inhibitors. Bioorg Med Chem25:838-846 (2017) 
 
Dual specificity mitogen-activated protein kinase kinase 1
Name:Dual specificity mitogen-activated protein kinase kinase 1
Type:Other Protein Type
Mol. Mass.:43439.03
Organism:Homo sapiens (Human)
Description:Full-length human MEK-1 was generated by PCR and purified as a fusion protein from Escherichia coli lysates.
Residue:393
BDBM50209653
NameBDBM50209653
Synonyms:CHEMBL3884616
TypeSmall organic molecule
Emp. Form.C23H22ClN5O3
Mol. Mass.451.905
SMILESClc1cnc(Nc2cccc(c2)N2CCOCC2)nc1Nc1ccccc1OC(=O)C=C