Reaction Details
TargetMitogen-activated protein kinase kinase kinase 7
LigandBDBM50209754
Substrate/Competitorn/a
Meas. Tech.ChEMBL_1633896 (CHEMBL3876688)
IC50 1630±n/a nM
Citation Tan, LGurbani, DWeisberg, ELHunter, JCLi, LJones, DSFicarro, SBMowafy, STam, CPRao, SDu, GGriffin, JDSorger, PKMarto, JAWestover, KDGray, NS Structure-guided development of covalent TAK1 inhibitors. Bioorg Med Chem25:838-846 (2017) 
 
Mitogen-activated protein kinase kinase kinase 7
Name:Mitogen-activated protein kinase kinase kinase 7
Type:Protein
Mol. Mass.:67199.89
Organism:Homo sapiens (Human)
Description:O43318
Residue:606
BDBM50209754
NameBDBM50209754
Synonyms:CHEMBL3884293
TypeSmall organic molecule
Emp. Form.C24H28ClN7O
Mol. Mass.465.978
SMILESCCC(=O)Nc1ccccc1Nc1nc(Nc2ccc(cc2)N2CCN(C)CC2)ncc1Cl