Reaction Details
TargetMitogen-activated protein kinase kinase kinase 7
LigandBDBM50209660
Substrate/Competitorn/a
Meas. Tech.ChEMBL_1633896 (CHEMBL3876688)
IC50 4.6±n/a nM
Citation Tan, LGurbani, DWeisberg, ELHunter, JCLi, LJones, DSFicarro, SBMowafy, STam, CPRao, SDu, GGriffin, JDSorger, PKMarto, JAWestover, KDGray, NS Structure-guided development of covalent TAK1 inhibitors. Bioorg Med Chem25:838-846 (2017) 
 
Mitogen-activated protein kinase kinase kinase 7
Name:Mitogen-activated protein kinase kinase kinase 7
Type:Protein
Mol. Mass.:67199.89
Organism:Homo sapiens (Human)
Description:O43318
Residue:606
BDBM50209660
NameBDBM50209660
Synonyms:CHEMBL3884281
TypeSmall organic molecule
Emp. Form.C21H21ClN6O3
Mol. Mass.440.883
SMILESClc1cnc(Nc2cnn(c2)C2CCOCC2)nc1Oc1ccccc1NC(=O)C=C