Reaction Details
TargetMitogen-activated protein kinase 1
LigandBDBM50042034
Substrate/Competitorn/a
Meas. Tech.ChEMBL_1633898 (CHEMBL3876690)
IC50 738±n/a nM
Citation Tan, LGurbani, DWeisberg, ELHunter, JCLi, LJones, DSFicarro, SBMowafy, STam, CPRao, SDu, GGriffin, JDSorger, PKMarto, JAWestover, KDGray, NS Structure-guided development of covalent TAK1 inhibitors. Bioorg Med Chem25:838-846 (2017) 
 
Mitogen-activated protein kinase 1
Name:Mitogen-activated protein kinase 1
Type:Ser/Thr Protein Kinase
Mol. Mass.:41392.76
Organism:Homo sapiens (Human)
Description:P28482
Residue:360
BDBM50042034
NameBDBM50042034
Synonyms:(5Z)-7-Oxozeaenol CHEBI:67559 | CHEMBL1077979
TypeSmall organic molecule
Emp. Form.C19H22O7
Mol. Mass.362.3738
SMILESCOc1cc(O)c2c(c1)\C=C\C[C@H](O)[C@H](O)C(=O)\C=C/C[C@H](C)OC2=O