Reaction Details
TargetMitogen-activated protein kinase 1
LigandBDBM50209752
Substrate/Competitorn/a
Meas. Tech.ChEMBL_1633898 (CHEMBL3876690)
IC50 9230±n/a nM
Citation Tan, LGurbani, DWeisberg, ELHunter, JCLi, LJones, DSFicarro, SBMowafy, STam, CPRao, SDu, GGriffin, JDSorger, PKMarto, JAWestover, KDGray, NS Structure-guided development of covalent TAK1 inhibitors. Bioorg Med Chem25:838-846 (2017) 
 
Mitogen-activated protein kinase 1
Name:Mitogen-activated protein kinase 1
Type:Ser/Thr Protein Kinase
Mol. Mass.:41392.76
Organism:Homo sapiens (Human)
Description:P28482
Residue:360
BDBM50209752
NameBDBM50209752
Synonyms:CHEMBL3885038
TypeSmall organic molecule
Emp. Form.C25H28N6O2
Mol. Mass.444.5288
SMILESCN1CCN(CC1)c1ccc(Nc2ncc(C)c(Oc3ccccc3NC(=O)C=C)n2)cc1