Reaction Details
TargetMitogen-activated protein kinase 1
LigandBDBM50209753
Substrate/Competitorn/a
Meas. Tech.ChEMBL_1633898 (CHEMBL3876690)
IC50 242±n/a nM
Citation Tan, LGurbani, DWeisberg, ELHunter, JCLi, LJones, DSFicarro, SBMowafy, STam, CPRao, SDu, GGriffin, JDSorger, PKMarto, JAWestover, KDGray, NS Structure-guided development of covalent TAK1 inhibitors. Bioorg Med Chem25:838-846 (2017) 
 
Mitogen-activated protein kinase 1
Name:Mitogen-activated protein kinase 1
Type:Ser/Thr Protein Kinase
Mol. Mass.:41392.76
Organism:Homo sapiens (Human)
Description:P28482
Residue:360
BDBM50209753
NameBDBM50209753
Synonyms:CHEMBL3884642
TypeSmall organic molecule
Emp. Form.C17H13ClF2N6O2
Mol. Mass.406.774
SMILESFC(F)n1cc(Nc2ncc(Cl)c(Oc3ccccc3NC(=O)C=C)n2)cn1