Reaction Details
TargetMitogen-activated protein kinase kinase kinase 7
LigandBDBM50209655
Substrate/Competitorn/a
Meas. Tech.ChEMBL_1633896 (CHEMBL3876688)
IC50 3010±n/a nM
Citation Tan, LGurbani, DWeisberg, ELHunter, JCLi, LJones, DSFicarro, SBMowafy, STam, CPRao, SDu, GGriffin, JDSorger, PKMarto, JAWestover, KDGray, NS Structure-guided development of covalent TAK1 inhibitors. Bioorg Med Chem25:838-846 (2017) 
 
Mitogen-activated protein kinase kinase kinase 7
Name:Mitogen-activated protein kinase kinase kinase 7
Type:Protein
Mol. Mass.:67199.89
Organism:Homo sapiens (Human)
Description:O43318
Residue:606
BDBM50209655
NameBDBM50209655
Synonyms:CHEMBL3885053
TypeSmall organic molecule
Emp. Form.C26H27N7O
Mol. Mass.453.5389
SMILESCN1CCN(CC1)c1ccc(Nc2ncc3ccn(-c4ccccc4NC(=O)C=C)c3n2)cc1