Reaction Details
TargetMitogen-activated protein kinase 1
LigandBDBM50209760
Substrate/Competitorn/a
Meas. Tech.ChEMBL_1633898 (CHEMBL3876690)
IC50 225±n/a nM
Citation Tan, LGurbani, DWeisberg, ELHunter, JCLi, LJones, DSFicarro, SBMowafy, STam, CPRao, SDu, GGriffin, JDSorger, PKMarto, JAWestover, KDGray, NS Structure-guided development of covalent TAK1 inhibitors. Bioorg Med Chem25:838-846 (2017) 
 
Mitogen-activated protein kinase 1
Name:Mitogen-activated protein kinase 1
Type:Ser/Thr Protein Kinase
Mol. Mass.:41392.76
Organism:Homo sapiens (Human)
Description:P28482
Residue:360
BDBM50209760
NameBDBM50209760
Synonyms:CHEMBL3885421
TypeSmall organic molecule
Emp. Form.C25H25ClN6O3
Mol. Mass.492.957
SMILESCC(=O)N1CCN(CC1)c1cccc(Nc2ncc(Cl)c(Nc3ccccc3OC(=O)C=C)n2)c1