Reaction Details
TargetHistone deacetylase 1
LigandBDBM50209788
Substrate/Competitorn/a
Meas. Tech.ChEBML_1634157
IC50 111±n/a nM
Citation Raji, IYadudu, FJaneira, EFathi, SSzymczak, LKornacki, JRKomatsu, KLi, JDMrksich, MOyelere, AK Bifunctional conjugates with potent inhibitory activity towards cyclooxygenase and histone deacetylase. Bioorg Med Chem25:1202-1218 (2017) 
 
Histone deacetylase 1
Name:Histone deacetylase 1
Type:Enzyme
Mol. Mass.:55090.27
Organism:Homo sapiens (Human)
Description:Q13547
Residue:482
BDBM50209788
NameBDBM50209788
Synonyms:CHEMBL3884506
TypeSmall organic molecule
Emp. Form.C28H33N5O5
Mol. Mass.519.5921
SMILESCOc1ccc2n(Cc3ccc(cc3)-c3cn(CCCCCCC(=O)NO)nn3)c(C)c(CC(O)=O)c2c1