Reaction Details
TargetHistone deacetylase 3
LigandBDBM50209787
Substrate/Competitorn/a
Meas. Tech.ChEBML_1634160
IC50 191±n/a nM
Citation Raji, IYadudu, FJaneira, EFathi, SSzymczak, LKornacki, JRKomatsu, KLi, JDMrksich, MOyelere, AK Bifunctional conjugates with potent inhibitory activity towards cyclooxygenase and histone deacetylase. Bioorg Med Chem25:1202-1218 (2017) 
 
Histone deacetylase 3
Name:Histone deacetylase 3
Type:Enzyme
Mol. Mass.:48829.55
Organism:Homo sapiens (Human)
Description:O15379
Residue:428
BDBM50209787
NameBDBM50209787
Synonyms:CHEMBL3883667
TypeSmall organic molecule
Emp. Form.C23H27N5O5S
Mol. Mass.485.556
SMILESCc1ccc(cc1)-c1cc(nn1-c1ccc(cc1)S(N)(=O)=O)C(=O)NCCCCCC(=O)NO