Reaction Details
TargetVascular endothelial growth factor receptor 2
LigandBDBM50210701
Substrate/Competitorn/a
Meas. Tech.ChEMBL_1634978 (CHEMBL3877876)
IC50 528±n/a nM
Citation Zhang, HQGong, FHYe, JQZhang, CYue, XHLi, CGXu, YGSun, LP Design and discovery of 4-anilinoquinazoline-urea derivatives as dual TK inhibitors of EGFR and VEGFR-2. Eur J Med Chem125:245-254 (2017) 
 
Vascular endothelial growth factor receptor 2
Name:Vascular endothelial growth factor receptor 2
Type:Receptor Tyrosine Kinase
Mol. Mass.:151510.97
Organism:Homo sapiens (Human)
Description:P35968
Residue:1356
BDBM50210701
NameBDBM50210701
Synonyms:CHEMBL3957025
TypeSmall organic molecule
Emp. Form.C29H30Cl2N6O4
Mol. Mass.597.492
SMILESCOc1cc2c(Nc3ccc(NC(=O)Nc4ccc(Cl)cc4)c(Cl)c3)ncnc2cc1OCCCN1CCOCC1