Reaction Details
TargetDihydroorotate dehydrogenase (quinone), mitochondrial
LigandBDBM50211957
Substrate/Competitorn/a
Meas. Tech.ChEMBL_1636657 (CHEMBL3879555)
Ki 8300±n/a nM
Citation Inaoka, DKIida, MHashimoto, STabuchi, TKuranaga, TBalogun, EOHonma, TTanaka, AHarada, SNara, TKita, KInoue, M Design and synthesis of potent substrate-based inhibitors of the Trypanosoma cruzi dihydroorotate dehydrogenase. Bioorg Med Chem25:1465-1470 (2017) 
 
Dihydroorotate dehydrogenase (quinone), mitochondrial
Name:Dihydroorotate dehydrogenase (quinone), mitochondrial
Type:Enzyme
Mol. Mass.:42881.33
Organism:Homo sapiens (Human)
Description:Q02127
Residue:395
BDBM50211957
NameBDBM50211957
Synonyms:CHEMBL3943890
TypeSmall organic molecule
Emp. Form.C21H23N3O6
Mol. Mass.413.4238
SMILESNCCO.OC(=O)c1[nH]c(=O)[nH]c(=O)c1CCc1ccc(Oc2ccccc2)cc1