Reaction Details
TargetHistamine H3 receptor
LigandBDBM50217235
Substrate/Competitorn/a
Meas. Tech.ChEMBL_83499 (CHEMBL694068)
Ki 1.9±n/a nM
Citation Tozer, MJBuck, IMCooke, TKalindjian, SBMcDonald, IMPether, MJSteel, KI 4-Chlorobenzyl sulfonamide and sulfamide derivatives of histamine homologues: the design of potent histamine H3 receptor antagonists. Bioorg Med Chem Lett9:3103-8 (1999) Histamine H3 receptor
Name:Histamine H3 receptor
Type:Enzyme Catalytic Domain
Mol. Mass.:48753.61
Organism:GUINEA PIG
Description:HISTAMINE H3 HRH3 GUINEA PIG::Q9JI35
Residue:445
BDBM50217235
NameBDBM50217235
Synonyms:CHEMBL104827
TypeSmall organic molecule
Emp. Form.C14H19BrN4O2S
Mol. Mass.387.295
SMILESBrc1ccc(CNS(=O)(=O)NCCCCc2c[nH]cn2)cc1