Reaction Details
TargetSubstance-P receptor
LigandBDBM50217526
Substrate/Competitorn/a
Meas. Tech.ChEMBL_144914 (CHEMBL749479)
IC50 1.9±n/a nM
Citation Nishi, TFukazawa, TIshibashi, KNakajima, KSugioka, YIio, YKurata, HItoh, KMukaiyama, OSatoh, YYamaguchi, T Combined NK1 and NK2 tachykinin receptor antagonists: synthesis and structure-activity relationships of novel oxazolidine analogues. Bioorg Med Chem Lett9:875-80 (1999) Substance-P receptor
Name:Substance-P receptor
Type:Enzyme Catalytic Domain
Mol. Mass.:46261.42
Organism:GUINEA PIG
Description:Neurokinin NK1 TACR1 GUINEA PIG::P30547
Residue:407
BDBM50217526
NameBDBM50217526
Synonyms:CHEMBL366972
TypeSmall organic molecule
Emp. Form.C31H35Cl2N3O6
Mol. Mass.616.532
SMILESCOc1cc(cc(OC)c1OC)C(=O)N1CO[C@@](CCN2CCC(O)(CC2)c2ccncc2)(C1)c1ccc(Cl)c(Cl)c1